{"text_format":"1","workbook":"xlsx","n_sheets":3,"sheets":["物品購入等競争入札参加資格審査申請書","別表","new_data"],"not_rendered":{"charts":0,"images":0,"macros":1,"external_links":0,"defined_names":30,"comments":0,"pivot_tables":0},"unopened":[],"bounds":{"document_bytes":16777216,"sheet_cells":100000,"rows_first":2000,"rows_last":500,"rows_between":2000,"halvings":0,"cell_chars":16384,"cell_head_chars":4096},"cells_cut":0,"cells_raw":0,"read":"whole","date_system":"1900"}

{"sheet":"物品購入等競争入札参加資格審査申請書","index":0,"n_rows":97,"n_cols":24,"rows_kept":97,"cut":false,"hidden":false,"merged":[[96,7,105,11],[24,4,24,11],[25,4,25,11],[58,5,58,11],[26,4,26,11],[28,4,28,11],[29,2,29,6],[30,2,30,6],[31,2,31,6],[27,4,27,11],[38,1,38,3],[54,5,54,11],[55,5,55,11],[56,5,56,11],[57,5,57,11],[52,5,52,11],[36,23,36,24],[35,3,35,5],[35,6,35,7],[34,1,34,9],[36,14,36,15],[36,16,36,18],[36,19,36,20],[36,21,36,22],[35,1,35,2],[35,8,35,9],[35,10,35,11],[70,5,70,7],[24,1,25,1],[26,1,28,1],[26,2,26,3],[24,2,25,3],[27,2,28,3],[53,5,53,11],[52,2,52,4],[53,2,54,4],[52,1,54,1],[21,1,23,1],[21,2,21,3],[22,4,22,11],[23,4,23,11],[22,2,23,3],[21,4,21,11],[14,2,14,3],[55,2,56,4],[58,2,59,4],[71,5,71,7],[39,1,44,11],[70,1,71,1],[67,2,67,4],[71,2,71,4],[60,2,60,6],[61,2,61,6],[70,2,70,4],[67,5,67,7],[70,8,70,10],[71,8,71,9],[68,5,68,6],[0,1,0,3],[7,1,7,11],[17,1,17,6],[10,1,10,11],[11,1,11,11],[12,1,12,11],[2,5,2,6],[3,5,3,6],[2,1,2,2],[3,1,3,2],[2,3,2,4],[3,3,3,4],[91,1,91,11],[92,1,92,11],[72,1,86,1],[72,2,72,11],[73,2,76,11],[77,2,77,11],[78,2,81,11],[82,2,82,11],[83,2,86,11],[90,1,90,11],[37,16,37,18],[37,19,37,20],[37,21,37,22],[37,23,37,24],[68,2,68,3],[66,2,66,5],[59,5,59,11],[65,1,65,3],[67,1,69,1],[55,1,59,1],[57,2,57,4],[68,8,68,9],[67,8,67,10],[37,14,37,15]]}
[null,"様式第１号（第３条関係）"]
[]
[null,"登録",null,"市内外",null,null,null,null,null,null,null,null,null,{"$f":"NOT(B4=\"\")","v":false}]
[null,null,null,null,null,null,null,null,null,null,null,null,null,{"$f":"NOT(D4=\"\")","v":false}]
[]
[]
[]
[null,"物品購入等競争入札参加資格審査申請書"]
[]
[]
[null,"　　令和４年度において、釜石市で購入する物品の製造の請負及び物品の売買に係る競争入札に参加する"]
[null,"　　資格を得たいので、関係書類を添えて申請します。"]
[null,"　　なお、この申請書の記載事項及び添付書類については、事実と相違ないことを誓約します。"]
[]
[null,"申請日"]
[]
[]
[null,"　　　　釜石市長　　野　田　武　則　  様"]
[]
[]
[null,"１　申請者"]
[null,"住　　所","郵便番号",null,null,null,null,null,null,null,null,null,null,{"$f":"NOT(E22=\"\")","v":false},{"$f":"COUNTIF(N22, \"TRUE\")","v":0}]
[null,null,"（ふりがな）\n住　　所",null,null,null,null,null,null,null,null,null,null,{"$f":"NOT(E23=\"\")","v":false},0]
[null,null,null,null,null,null,null,null,null,null,null,null,null,{"$f":"NOT(E24=\"\")","v":false},0]
[null,"商号又は名称","（ふりがな）\n商号又は名称",null,null,null,null,null,null,null,null,null,null,false,0]
[null,null,null,null,null,null,null,null,null,null,null,null,null,false,0]
[null,"代表者役職・氏名","代表者役職",null,null,null,null,null,null,null,null,null,null,false,0]
[null,null,"（ふりがな）\n代表者氏名",null,null,null,null,null,null,null,null,null,null,false,0]
[null,null,null,null,null,null,null,null,null,null,null,null,null,{"$f":"NOT(E29=\"\")","v":false},0]
[null,"電話番号",null,null,null,null,null,null,null,null,null,null,null,{"$f":"NOT(C30=\"\")","v":false},0]
[null,"FAX番号",null,null,null,null,null,null,null,null,null,null,null,{"$f":"NOT(C31=\"\")","v":false},0]
[null,"申請担当者",null,null,null,null,null,null,null,null,null,null,null,false,0]
[]
[]
[null,"２　希望する製造等の種類（該当にチェック※複数選択可）"]
[null,"　　 1 製　造",null,"　　2 販売〔a 卸売〕",null,null,"　　2 販売〔b 小売〕",null,"　　 3 買 受 け",null,"　　4 役務・賃貸業",null,null,{"$f":"IF(COUNTIF(O37:Y37, \"TRUE\"), \"TRUE\", \"\")","v":""},{"$f":"COUNTIF(N36, \"TRUE\")","v":0}]
[null,null,null,null,null,null,null,null,null,null,null,null,null,null,false,null,false,null,null,false,null,false,null,false]
[null,null,null,null,null,null,null,null,null,null,null,null,null,null,{"$f":"IF(O37=TRUE,B36,\"\")","v":""},null,{"$f":"IF(Q37=TRUE,D36,\"\")","v":""},null,null,{"$f":"IF(T37=TRUE,G36,\"\")","v":""},null,{"$f":"IF(V37=TRUE,I36,\"\")","v":""},null,{"$f":"IF(X37=TRUE,K36,\"\")","v":""}]
[null,"３　希望する営業品目等"]
[null,{"$f":"_xlfn.TEXTJOIN(\"、 \",TRUE,別表!H4:H146)","v":""}]
{"$rows_left_out":58}
{"sheet":"別表","index":1,"n_rows":146,"n_cols":9,"rows_kept":146,"cut":false,"hidden":false,"merged":[[27,6,29,6],[30,6,35,6],[36,6,40,6],[41,6,44,6],[0,1,0,2],[3,6,6,6],[7,6,9,6],[10,6,17,6],[18,6,21,6],[22,6,26,6],[1,1,1,2],[45,6,47,6],[48,6,50,6],[51,6,56,6],[57,6,70,6],[71,6,80,6],[81,6,89,6],[90,6,101,6],[102,6,104,6],[105,6,108,6],[109,6,111,6],[130,6,132,6],[133,6,143,6],[112,6,113,6],[114,6,116,6],[117,6,120,6],[121,6,124,6],[125,6,129,6]]}
[null,"別表（第3条関係）希望営業品目一覧　"]
[null,"希望営業品目一覧　"]
[null,"大分類番号","大分類","小分類番号","小分類","希望する営業品目等","備考"]
[null,1,"事務用品類 ","a","用紙類",null,null,{"$f":"IFERROR(INDEX(B4&C4&D4&E4,MATCH(\"●\",F4:F4,0)),\"\")","v":""},{"$f":"IFERROR(INDEX(E4,MATCH(\"●\",F4:F4,0)),\"\")","v":""}]
[null,1,"事務用品類 ","b","事務備品",null,null,{"$f":"IFERROR(INDEX(B4&C4&D5&E5,MATCH(\"●\",F5:F5,0)),\"\")","v":""},{"$f":"IFERROR(INDEX(E5,MATCH(\"●\",F5:F5,0)),\"\")","v":""}]
[null,1,"事務用品類 ","c","事務用品",null,null,{"$f":"IFERROR(INDEX(B4&C4&D6&E6,MATCH(\"●\",F6:F6,0)),\"\")","v":""},{"$f":"IFERROR(INDEX(E6,MATCH(\"●\",F6:F6,0)),\"\")","v":""}]
[null,1,"事務用品類 ","d","その他",null,null,{"$f":"IFERROR(INDEX(B4&C4&D7&E7,MATCH(\"●\",F7:F7,0)),\"\")","v":""},{"$f":"IFERROR(INDEX(E7,MATCH(\"●\",F7:F7,0)),\"\")","v":""}]
[null,2,"OA関連機器 ","a","コンピュータ機器",null,null,{"$f":"IFERROR(INDEX(B8&C8&D8&E8,MATCH(\"●\",F8:F8,0)),\"\")","v":""},{"$f":"IFERROR(INDEX(E8,MATCH(\"●\",F8:F8,0)),\"\")","v":""}]
[null,2,"OA関連機器 ","b","コンピュータ関連用品",null,null,{"$f":"IFERROR(INDEX(B8&C8&D9&E9,MATCH(\"●\",F9:F9,0)),\"\")","v":""},""]
[null,2,"OA関連機器 ","c","その他",null,null,{"$f":"IFERROR(INDEX(B8&C8&D10&E10,MATCH(\"●\",F10:F10,0)),\"\")","v":""},""]
[null,3," 家具・室内装飾品 ","a","木製家具",null,null,{"$f":"IFERROR(INDEX(B11&C11&D11&E11,MATCH(\"●\",F11:F11,0)),\"\")","v":""},""]
[null,3," 家具・室内装飾品 ","b","スチール製家具",null,null,{"$f":"IFERROR(INDEX(B11&C11&D12&E12,MATCH(\"●\",F12:F12,0)),\"\")","v":""},""]
[null,3," 家具・室内装飾品 ","c","建具",null,null,{"$f":"IFERROR(INDEX(B11&C11&D13&E13,MATCH(\"●\",F13:F13,0)),\"\")","v":""},""]
[null,3," 家具・室内装飾品 ","d","カーテン・暗幕",null,null,{"$f":"IFERROR(INDEX(B11&C11&D14&E14,MATCH(\"●\",F14:F14,0)),\"\")","v":""},""]
[null,3," 家具・室内装飾品 ","e","ブラインド",null,null,{"$f":"IFERROR(INDEX(B11&C11&D15&E15,MATCH(\"●\",F15:F15,0)),\"\")","v":""},""]
[null,3," 家具・室内装飾品 ","f","ござ・畳",null,null,{"$f":"IFERROR(INDEX(B11&C11&D16&E16,MATCH(\"●\",F16:F16,0)),\"\")","v":""},""]
[null,3," 家具・室内装飾品 ","g","じゅうたん",null,null,{"$f":"IFERROR(INDEX(B11&C11&D17&E17,MATCH(\"●\",F17:F17,0)),\"\")","v":""},""]
[null,3," 家具・室内装飾品 ","h","その他",null,null,{"$f":"IFERROR(INDEX(B11&C11&D18&E18,MATCH(\"●\",F18:F18,0)),\"\")","v":""},""]
[null,4,"通信機器 ","a","ファクシミリ",null,null,{"$f":"IFERROR(INDEX(B19&C19&D19&E19,MATCH(\"●\",F19:F19,0)),\"\")","v":""},""]
[null,4,"通信機器 ","b","無線機器",null,null,{"$f":"IFERROR(INDEX(B19&C19&D20&E20,MATCH(\"●\",F20:F20,0)),\"\")","v":""},""]
[null,4,"通信機器 ","c","電話機器",null,null,{"$f":"IFERROR(INDEX(B19&C19&D21&E21,MATCH(\"●\",F21:F21,0)),\"\")","v":""},""]
[null,4,"通信機器 ","d","その他",null,null,{"$f":"IFERROR(INDEX(B19&C19&D22&E22,MATCH(\"●\",F22:F22,0)),\"\")","v":""},""]
[null,5,"印刷機 ","a","PPC複写機",null,null,{"$f":"IFERROR(INDEX(B23&C23&D23&E23,MATCH(\"●\",F23:F23,0)),\"\")","v":""},""]
[null,5,"印刷機 ","b","自動印刷機",null,null,{"$f":"IFERROR(INDEX(B23&C23&D24&E24,MATCH(\"●\",F24:F24,0)),\"\")","v":""},""]
[null,5,"印刷機 ","c","謄写輪転機",null,null,{"$f":"IFERROR(INDEX(B23&C23&D25&E25,MATCH(\"●\",F25:F25,0)),\"\")","v":""},""]
[null,5,"印刷機 ","d","ファックス輪転機",null,null,{"$f":"IFERROR(INDEX(B23&C23&D26&E26,MATCH(\"●\",F26:F26,0)),\"\")","v":""},""]
[null,5,"印刷機 ","e","その他",null,null,{"$f":"IFERROR(INDEX(B23&C23&D27&E27,MATCH(\"●\",F27:F27,0)),\"\")","v":""},""]
[null,6,"写真・光学機器 ","a","写真機器及び用品",null,null,{"$f":"IFERROR(INDEX(B28&C28&D28&E28,MATCH(\"●\",F28:F28,0)),\"\")","v":""},""]
[null,6,"写真・光学機器 ","b","光学機器及び用品",null,null,{"$f":"IFERROR(INDEX(B28&C28&D29&E29,MATCH(\"●\",F29:F29,0)),\"\")","v":""},""]
[null,6,"写真・光学機器 ","c","その他",null,null,{"$f":"IFERROR(INDEX(B28&C28&D30&E30,MATCH(\"●\",F30:F30,0)),\"\")","v":""},""]
[null,7,"計測機器 ","a","測量機器",null,null,{"$f":"IFERROR(INDEX(B31&C31&D31&E31,MATCH(\"●\",F31:F31,0)),\"\")","v":""},""]
[null,7,"計測機器 ","b","設計・製図器具",null,null,{"$f":"IFERROR(INDEX(B31&C31&D32&E32,MATCH(\"●\",F32:F32,0)),\"\")","v":""},""]
[null,7,"計測機器 ","c","計量機器",null,null,{"$f":"IFERROR(INDEX(B31&C31&D33&E33,MATCH(\"●\",F33:F33,0)),\"\")","v":""},""]
[null,7,"計測機器 ","d","観測機器",null,null,{"$f":"IFERROR(INDEX(B31&C31&D34&E34,MATCH(\"●\",F34:F34,0)),\"\")","v":""},""]
[null,7,"計測機器 ","e","公害測定機器",null,null,{"$f":"IFERROR(INDEX(B31&C31&D35&E35,MATCH(\"●\",F35:F35,0)),\"\")","v":""},""]
[null,7,"計測機器 ","f","その他",null,null,{"$f":"IFERROR(INDEX(B31&C31&D36&E36,MATCH(\"●\",F36:F36,0)),\"\")","v":""},""]
[null,8,"電気機器 ","a","家庭用電気機器",null,null,{"$f":"IFERROR(INDEX(B37&C37&D37&E37,MATCH(\"●\",F37:F37,0)),\"\")","v":""},""]
[null,8,"電気機器 ","b","業務用電気機器",null,null,{"$f":"IFERROR(INDEX(B37&C37&D38&E38,MATCH(\"●\",F38:F38,0)),\"\")","v":""},""]
[null,8,"電気機器 ","c","視聴覚機器",null,null,{"$f":"IFERROR(INDEX(B37&C37&D39&E39,MATCH(\"●\",F39:F39,0)),\"\")","v":""},""]
[null,8,"電気機器 ","d","電気用品",null,null,{"$f":"IFERROR(INDEX(B37&C37&D40&E40,MATCH(\"●\",F40:F40,0)),\"\")","v":""},""]
{"$rows_left_out":107}
{"sheet":"new_data","index":2,"n_rows":29,"n_cols":43,"rows_kept":29,"cut":false,"hidden":true,"merged":[]}
["申込日","希望する品目の\n大分類番号","大分類","業者名","代表者役職","代表者氏名","郵便番号","住所","電話番号","FAX番号","契約場所","契約場所\n代表者役職","契約場所\n代表者氏名","郵便番号","地域","住所","電話番号","FAX番号","小分類","備考",null,"希望する製造等\nの種類","希望する製造等\nの種類","希望する製造等\nの種類","希望する製造等\nの種類","希望する製造等\nの種類","資本金","事務職員","技術職員","その他の職員","計","受任者\n事務職員","受任者\n技術職員","受任者\nその他の職員","受任者\n計","創業","現組織に変更","営業年数","【機械装置類】","【運搬具類】","【工具その他】"]
[{"$f":"物品購入等競争入札参加資格審査申請書!C15","v":"00:00:00"},{"$f":"IFERROR(INDEX(別表!B4:'別表'!B7,MATCH(\"●\",別表!F4:'別表'!F7,0)),\"\")","v":""},{"$f":"IFERROR(INDEX(別表!C4:'別表'!C7,MATCH(\"●\",別表!F4:'別表'!F7,0)),\"\")","v":""},{"$f":"物品購入等競争入札参加資格審査申請書!E26","v":0},{"$f":"物品購入等競争入札参加資格審査申請書!E27","v":0},{"$f":"物品購入等競争入札参加資格審査申請書!E29","v":0},{"$f":"物品購入等競争入札参加資格審査申請書!E22","v":0},{"$f":"物品購入等競争入札参加資格審査申請書!E24","v":0},{"$f":"物品購入等競争入札参加資格審査申請書!C30","v":0},{"$f":"物品購入等競争入札参加資格審査申請書!C31","v":0},{"$f":"物品購入等競争入札参加資格審査申請書!F57","v":0},{"$f":"物品購入等競争入札参加資格審査申請書!F58","v":0},{"$f":"物品購入等競争入札参加資格審査申請書!F60","v":0},{"$f":"物品購入等競争入札参加資格審査申請書!F53","v":0},{"$f":"物品購入等競争入札参加資格審査申請書!D4","v":0},{"$f":"物品購入等競争入札参加資格審査申請書!F55","v":0},{"$f":"物品購入等競争入札参加資格審査申請書!C61","v":0},{"$f":"物品購入等競争入札参加資格審査申請書!C62","v":0},{"$f":"_xlfn.TEXTJOIN(\"　 \",TRUE,別表!I4:I7)","v":""},{"$f":"IFERROR(VLOOKUP(AQ2,別表!B4:G7,6,FALSE),\"\")","v":""},null,{"$f":"物品購入等競争入札参加資格審査申請書!O38","v":""},{"$f":"物品購入等競争入札参加資格審査申請書!Q38","v":""},{"$f":"物品購入等競争入札参加資格審査申請書!T38","v":""},{"$f":"物品購入等競争入札参加資格審査申請書!V38","v":""},{"$f":"物品購入等競争入札参加資格審査申請書!X38","v":""},{"$f":"物品購入等競争入札参加資格審査申請書!C67","v":0},{"$f":"物品購入等競争入札参加資格審査申請書!C69","v":0},{"$f":"物品購入等競争入札参加資格審査申請書!F69","v":0},{"$f":"物品購入等競争入札参加資格審査申請書!I69","v":0},{"$f":"物品購入等競争入札参加資格審査申請書!L69","v":0},{"$f":"物品購入等競争入札参加資格審査申請書!D70","v":0},{"$f":"物品購入等競争入札参加資格審査申請書!G70","v":0},{"$f":"物品購入等競争入札参加資格審査申請書!J70","v":0},{"$f":"物品購入等競争入札参加資格審査申請書!L70","v":0},{"$f":"物品購入等競争入札参加資格審査申請書!C72","v":"00:00:00"},{"$f":"物品購入等競争入札参加資格審査申請書!F72","v":"00:00:00"},{"$f":"物品購入等競争入札参加資格審査申請書!I72","v":0},{"$f":"物品購入等競争入札参加資格審査申請書!C74","v":0},{"$f":"物品購入等競争入札参加資格審査申請書!C79","v":0},{"$f":"物品購入等競争入札参加資格審査申請書!C84","v":0},null,{"$f":"B2","v":""}]
[{"$f":"A2","v":"00:00:00"},{"$f":"IFERROR(INDEX(別表!B8:'別表'!B10,MATCH(\"●\",別表!F8:'別表'!F10,0)),\"\")","v":""},{"$f":"IFERROR(INDEX(別表!C8:'別表'!C10,MATCH(\"●\",別表!F8:'別表'!F10,0)),\"\")","v":""},{"$f":"D2","v":0},{"$f":"E2","v":0},{"$f":"F2","v":0},0,0,0,0,0,0,0,0,0,0,0,{"$f":"R2","v":0},{"$f":"_xlfn.TEXTJOIN(\"　 \",TRUE,別表!I8:I10)","v":""},{"$f":"IFERROR(VLOOKUP(AQ3,別表!B8:G10,6,FALSE),\"\")","v":""},null,{"$f":"V2","v":""},{"$f":"W2","v":""},{"$f":"X2","v":""},"","",0,0,0,0,0,0,0,0,0,"00:00:00","00:00:00",0,0,0,0,null,""]
[{"$f":"A2","v":"00:00:00"},{"$f":"IFERROR(INDEX(別表!B11:'別表'!B18,MATCH(\"●\",別表!F11:'別表'!F18,0)),\"\")","v":""},{"$f":"IFERROR(INDEX(別表!C11:'別表'!C18,MATCH(\"●\",別表!F11:'別表'!F18,0)),\"\")","v":""},{"$f":"D2","v":0},{"$f":"E2","v":0},0,0,0,0,0,0,0,0,0,0,0,0,0,{"$f":"_xlfn.TEXTJOIN(\"　 \",TRUE,別表!I11:I18)","v":""},{"$f":"IFERROR(VLOOKUP(AQ4,別表!B11:G18,6,FALSE),\"\")","v":""},null,{"$f":"V3","v":""},{"$f":"W3","v":""},{"$f":"X3","v":""},{"$f":"Y3","v":""},{"$f":"Z3","v":""},{"$f":"AA3","v":0},{"$f":"AB3","v":0},{"$f":"AC3","v":0},{"$f":"AD3","v":0},{"$f":"AE3","v":0},{"$f":"AF3","v":0},{"$f":"AG3","v":0},{"$f":"AH3","v":0},{"$f":"AI3","v":0},{"$f":"AJ3","v":"00:00:00"},{"$f":"AK3","v":"00:00:00"},{"$f":"AL3","v":0},{"$f":"AM3","v":0},{"$f":"AN3","v":0},{"$f":"AO3","v":0},null,""]
[{"$f":"A2","v":"00:00:00"},{"$f":"IFERROR(INDEX(別表!B19:'別表'!B22,MATCH(\"●\",別表!F19:'別表'!F22,0)),\"\")","v":""},{"$f":"IFERROR(INDEX(別表!C19:'別表'!C22,MATCH(\"●\",別表!F19:'別表'!F22,0)),\"\")","v":""},0,0,0,0,0,0,0,0,0,0,0,0,0,0,0,{"$f":"_xlfn.TEXTJOIN(\"　 \",TRUE,別表!I19:I22)","v":""},{"$f":"IFERROR(VLOOKUP(AQ5,別表!B19:G22,6,FALSE),\"\")","v":""},null,{"$f":"V4","v":""},{"$f":"W4","v":""},"","","",0,0,0,0,0,0,0,0,0,"00:00:00","00:00:00",0,0,0,0,null,""]
[{"$f":"A2","v":"00:00:00"},{"$f":"IFERROR(INDEX(別表!B23:'別表'!B27,MATCH(\"●\",別表!F23:'別表'!F27,0)),\"\")","v":""},{"$f":"IFERROR(INDEX(別表!C23:'別表'!C27,MATCH(\"●\",別表!F23:'別表'!F27,0)),\"\")","v":""},0,0,0,0,0,0,0,0,0,0,0,0,0,0,0,{"$f":"_xlfn.TEXTJOIN(\"　 \",TRUE,別表!I23:I27)","v":""},{"$f":"IFERROR(VLOOKUP(AQ6,別表!B23:G27,6,FALSE),\"\")","v":""},null,"","",{"$f":"X5","v":""},{"$f":"Y5","v":""},{"$f":"Z5","v":""},{"$f":"AA5","v":0},{"$f":"AB5","v":0},{"$f":"AC5","v":0},{"$f":"AD5","v":0},{"$f":"AE5","v":0},{"$f":"AF5","v":0},{"$f":"AG5","v":0},{"$f":"AH5","v":0},{"$f":"AI5","v":0},{"$f":"AJ5","v":"00:00:00"},{"$f":"AK5","v":"00:00:00"},{"$f":"AL5","v":0},{"$f":"AM5","v":0},{"$f":"AN5","v":0},{"$f":"AO5","v":0},null,""]
[{"$f":"A2","v":"00:00:00"},{"$f":"IFERROR(INDEX(別表!B28:'別表'!B30,MATCH(\"●\",別表!F28:'別表'!F30,0)),\"\")","v":""},{"$f":"IFERROR(INDEX(別表!C28:'別表'!C30,MATCH(\"●\",別表!F28:'別表'!F30,0)),\"\")","v":""},{"$f":"D5","v":0},0,0,0,0,0,0,0,0,0,0,0,0,0,0,{"$f":"_xlfn.TEXTJOIN(\"　 \",TRUE,別表!I28:I30)","v":""},{"$f":"IFERROR(VLOOKUP(AQ7,別表!B28:G30,6,FALSE),\"\")","v":""},null,"","","","","",0,0,0,0,0,0,0,0,0,"00:00:00","00:00:00",0,0,0,0,null,""]
[{"$f":"A2","v":"00:00:00"},{"$f":"IFERROR(INDEX(別表!B31:'別表'!B36,MATCH(\"●\",別表!F31:'別表'!F36,0)),\"\")","v":""},{"$f":"IFERROR(INDEX(別表!C31:'別表'!C36,MATCH(\"●\",別表!F31:'別表'!F36,0)),\"\")","v":""},{"$f":"D6","v":0},0,0,0,0,0,0,0,0,0,0,0,0,0,0,{"$f":"_xlfn.TEXTJOIN(\"　 \",TRUE,別表!I31:I36)","v":""},{"$f":"IFERROR(VLOOKUP(AQ8,別表!B31:G36,6,FALSE),\"\")","v":""},null,"","","","","",0,0,0,0,0,0,0,0,0,"00:00:00","00:00:00",0,0,0,0,null,""]
[{"$f":"A2","v":"00:00:00"},{"$f":"IFERROR(INDEX(別表!B37:'別表'!B41,MATCH(\"●\",別表!F37:'別表'!F41,0)),\"\")","v":""},{"$f":"IFERROR(INDEX(別表!C37:'別表'!C41,MATCH(\"●\",別表!F37:'別表'!F41,0)),\"\")","v":""},{"$f":"D7","v":0},0,0,0,0,0,0,0,0,0,0,0,0,0,0,{"$f":"_xlfn.TEXTJOIN(\"　 \",TRUE,別表!I37:I41)","v":""},{"$f":"IFERROR(VLOOKUP(AQ9,別表!B37:G41,6,FALSE),\"\")","v":""},null,"","","","","",0,0,0,0,0,0,0,0,0,"00:00:00","00:00:00",0,0,0,0,null,""]
[{"$f":"A2","v":"00:00:00"},{"$f":"IFERROR(INDEX(別表!B42:'別表'!B45,MATCH(\"●\",別表!F42:'別表'!F45,0)),\"\")","v":""},{"$f":"IFERROR(INDEX(別表!C42:'別表'!C45,MATCH(\"●\",別表!F42:'別表'!F45,0)),\"\")","v":""},{"$f":"D8","v":0},0,0,0,0,0,0,0,0,0,0,0,0,0,0,{"$f":"_xlfn.TEXTJOIN(\"　 \",TRUE,別表!I42:I45)","v":""},{"$f":"IFERROR(VLOOKUP(AQ10,別表!B42:G45,6,FALSE),\"\")","v":""},null,"","","","","",0,0,0,0,0,0,0,0,0,"00:00:00","00:00:00",0,0,0,0,null,""]
[{"$f":"A2","v":"00:00:00"},{"$f":"IFERROR(INDEX(別表!B46:'別表'!B48,MATCH(\"●\",別表!F46:'別表'!F48,0)),\"\")","v":""},{"$f":"IFERROR(INDEX(別表!C46:'別表'!C48,MATCH(\"●\",別表!F46:'別表'!F48,0)),\"\")","v":""},{"$f":"D9","v":0},0,0,0,0,0,0,0,0,0,0,0,0,0,0,{"$f":"_xlfn.TEXTJOIN(\"　 \",TRUE,別表!I46:I48)","v":""},{"$f":"IFERROR(VLOOKUP(AQ11,別表!B46:G48,6,FALSE),\"\")","v":""},null,"","","","","",0,0,0,0,0,0,0,0,0,"00:00:00","00:00:00",0,0,0,0,null,""]
[{"$f":"A2","v":"00:00:00"},{"$f":"IFERROR(INDEX(別表!B49:'別表'!B51,MATCH(\"●\",別表!F49:'別表'!F51,0)),\"\")","v":""},{"$f":"IFERROR(INDEX(別表!C49:'別表'!C51,MATCH(\"●\",別表!F49:'別表'!F51,0)),\"\")","v":""},{"$f":"D10","v":0},0,0,0,0,0,0,0,0,0,0,0,0,0,0,{"$f":"_xlfn.TEXTJOIN(\"　 \",TRUE,別表!I49:I51)","v":""},{"$f":"IFERROR(VLOOKUP(AQ12,別表!B49:G51,6,FALSE),\"\")","v":""},null,"","","","","",0,0,0,0,0,0,0,0,0,"00:00:00","00:00:00",0,0,0,0,null,""]
[{"$f":"A2","v":"00:00:00"},{"$f":"IFERROR(INDEX(別表!B52:'別表'!B57,MATCH(\"●\",別表!F52:'別表'!F57,0)),\"\")","v":""},{"$f":"IFERROR(INDEX(別表!C52:'別表'!C57,MATCH(\"●\",別表!F52:'別表'!F57,0)),\"\")","v":""},{"$f":"D11","v":0},0,0,0,0,0,0,0,0,0,0,0,0,0,0,{"$f":"_xlfn.TEXTJOIN(\"　 \",TRUE,別表!I52:I57)","v":""},{"$f":"IFERROR(VLOOKUP(AQ13,別表!B52:G57,6,FALSE),\"\")","v":""},null,"","","","","",0,0,0,0,0,0,0,0,0,"00:00:00","00:00:00",0,0,0,0,null,""]
[{"$f":"A2","v":"00:00:00"},{"$f":"IFERROR(INDEX(別表!B58:'別表'!B71,MATCH(\"●\",別表!F58:'別表'!F71,0)),\"\")","v":""},{"$f":"IFERROR(INDEX(別表!C58:'別表'!C71,MATCH(\"●\",別表!F58:'別表'!F71,0)),\"\")","v":""},{"$f":"D12","v":0},0,0,0,0,0,0,0,0,0,0,0,0,0,0,{"$f":"_xlfn.TEXTJOIN(\"　 \",TRUE,別表!I58:I71)","v":""},{"$f":"IFERROR(VLOOKUP(AQ14,別表!B58:G71,6,FALSE),\"\")","v":""},null,"","","","","",0,0,0,0,0,0,0,0,0,"00:00:00","00:00:00",0,0,0,0,null,""]
[{"$f":"A2","v":"00:00:00"},{"$f":"IFERROR(INDEX(別表!B72:'別表'!B81,MATCH(\"●\",別表!F72:'別表'!F81,0)),\"\")","v":""},{"$f":"IFERROR(INDEX(別表!C72:'別表'!C81,MATCH(\"●\",別表!F72:'別表'!F81,0)),\"\")","v":""},{"$f":"D13","v":0},0,0,0,0,0,0,0,0,0,0,0,0,0,0,{"$f":"_xlfn.TEXTJOIN(\"　 \",TRUE,別表!I72:I81)","v":""},{"$f":"IFERROR(VLOOKUP(AQ15,別表!B72:G81,6,FALSE),\"\")","v":""},null,"","","","","",0,0,0,0,0,0,0,0,0,"00:00:00","00:00:00",0,0,0,0,null,""]
[{"$f":"A2","v":"00:00:00"},{"$f":"IFERROR(INDEX(別表!B82:'別表'!B90,MATCH(\"●\",別表!F82:'別表'!F90,0)),\"\")","v":""},{"$f":"IFERROR(INDEX(別表!C82:'別表'!C90,MATCH(\"●\",別表!F82:'別表'!F90,0)),\"\")","v":""},{"$f":"D14","v":0},0,0,0,0,0,0,0,0,0,0,0,0,0,0,{"$f":"_xlfn.TEXTJOIN(\"　 \",TRUE,別表!I82:I90)","v":""},{"$f":"IFERROR(VLOOKUP(AQ16,別表!B82:G90,6,FALSE),\"\")","v":""},null,"","","","","",0,0,0,0,0,0,0,0,0,"00:00:00","00:00:00",0,0,0,0,null,""]
[{"$f":"A2","v":"00:00:00"},{"$f":"IFERROR(INDEX(別表!B91:'別表'!B102,MATCH(\"●\",別表!F91:'別表'!F102,0)),\"\")","v":""},{"$f":"IFERROR(INDEX(別表!C91:'別表'!C102,MATCH(\"●\",別表!F91:'別表'!F102,0)),\"\")","v":""},{"$f":"D15","v":0},0,0,0,0,0,0,0,0,0,0,0,0,0,0,{"$f":"_xlfn.TEXTJOIN(\"　 \",TRUE,別表!I91:I102)","v":""},{"$f":"IFERROR(VLOOKUP(AQ17,別表!B91:G102,6,FALSE),\"\")","v":""},null,"","","","","",0,0,0,0,0,0,0,0,0,"00:00:00","00:00:00",0,0,0,0,null,""]
[{"$f":"A2","v":"00:00:00"},{"$f":"IFERROR(INDEX(別表!B103:'別表'!B105,MATCH(\"●\",別表!F103:'別表'!F105,0)),\"\")","v":""},{"$f":"IFERROR(INDEX(別表!C103:'別表'!C105,MATCH(\"●\",別表!F103:'別表'!F105,0)),\"\")","v":""},{"$f":"D16","v":0},0,0,0,0,0,0,0,0,0,0,0,0,0,0,{"$f":"_xlfn.TEXTJOIN(\"　 \",TRUE,別表!I103:I105)","v":""},{"$f":"IFERROR(VLOOKUP(AQ18,別表!B103:G105,6,FALSE),\"\")","v":""},null,"","","","","",0,0,0,0,0,0,0,0,0,"00:00:00","00:00:00",0,0,0,0,null,""]
[{"$f":"A2","v":"00:00:00"},{"$f":"IFERROR(INDEX(別表!B106:'別表'!B109,MATCH(\"●\",別表!F106:'別表'!F109,0)),\"\")","v":""},{"$f":"IFERROR(INDEX(別表!C106:'別表'!C109,MATCH(\"●\",別表!F106:'別表'!F109,0)),\"\")","v":""},{"$f":"D17","v":0},0,0,0,0,0,0,0,0,0,0,0,0,0,0,{"$f":"_xlfn.TEXTJOIN(\"　 \",TRUE,別表!I106:I109)","v":""},{"$f":"IFERROR(VLOOKUP(AQ19,別表!B106:G109,6,FALSE),\"\")","v":""},null,"","","","","",0,0,0,0,0,0,0,0,0,"00:00:00","00:00:00",0,0,0,0,null,""]
[{"$f":"A2","v":"00:00:00"},{"$f":"IFERROR(INDEX(別表!B110:'別表'!B112,MATCH(\"●\",別表!F110:'別表'!F112,0)),\"\")","v":""},{"$f":"IFERROR(INDEX(別表!C110:'別表'!C112,MATCH(\"●\",別表!F110:'別表'!F112,0)),\"\")","v":""},{"$f":"D18","v":0},0,0,0,0,0,0,0,0,0,0,0,0,0,0,{"$f":"_xlfn.TEXTJOIN(\"　 \",TRUE,別表!I110:I112)","v":""},{"$f":"IFERROR(VLOOKUP(AQ20,別表!B110:G112,6,FALSE),\"\")","v":""},null,"","","","","",0,0,0,0,0,0,0,0,0,"00:00:00","00:00:00",0,0,0,0,null,""]
[{"$f":"A2","v":"00:00:00"},{"$f":"IFERROR(INDEX(別表!B113:'別表'!B114,MATCH(\"●\",別表!F113:'別表'!F114,0)),\"\")","v":""},{"$f":"IFERROR(INDEX(別表!C113:'別表'!C114,MATCH(\"●\",別表!F113:'別表'!F114,0)),\"\")","v":""},{"$f":"D19","v":0},0,0,0,0,0,0,0,0,0,0,0,0,0,0,{"$f":"_xlfn.TEXTJOIN(\"　 \",TRUE,別表!I113:I114)","v":""},{"$f":"IFERROR(VLOOKUP(AQ21,別表!B113:G114,6,FALSE),\"\")","v":""},null,"","","","","",0,0,0,0,0,0,0,0,0,"00:00:00","00:00:00",0,0,0,0,null,""]
[{"$f":"A2","v":"00:00:00"},{"$f":"IFERROR(INDEX(別表!B115:'別表'!B117,MATCH(\"●\",別表!F115:'別表'!F117,0)),\"\")","v":""},{"$f":"IFERROR(INDEX(別表!C115:'別表'!C117,MATCH(\"●\",別表!F115:'別表'!F117,0)),\"\")","v":""},{"$f":"D20","v":0},0,0,0,0,0,0,0,0,0,0,0,0,0,0,{"$f":"_xlfn.TEXTJOIN(\"　 \",TRUE,別表!I115:I117)","v":""},{"$f":"IFERROR(VLOOKUP(AQ22,別表!B115:G117,6,FALSE),\"\")","v":""},null,"","","","","",0,0,0,0,0,0,0,0,0,"00:00:00","00:00:00",0,0,0,0,null,""]
[{"$f":"A2","v":"00:00:00"},{"$f":"IFERROR(INDEX(別表!B118:'別表'!B121,MATCH(\"●\",別表!F118:'別表'!F121,0)),\"\")","v":""},{"$f":"IFERROR(INDEX(別表!C118:'別表'!C121,MATCH(\"●\",別表!F118:'別表'!F121,0)),\"\")","v":""},{"$f":"D21","v":0},0,0,0,0,0,0,0,0,0,0,0,0,0,0,{"$f":"_xlfn.TEXTJOIN(\"　 \",TRUE,別表!I118:I121)","v":""},{"$f":"IFERROR(VLOOKUP(AQ23,別表!B118:G121,6,FALSE),\"\")","v":""},null,"","","","","",0,0,0,0,0,0,0,0,0,"00:00:00","00:00:00",0,0,0,0,null,""]
[{"$f":"A2","v":"00:00:00"},{"$f":"IFERROR(INDEX(別表!B122:'別表'!B125,MATCH(\"●\",別表!F122:'別表'!F125,0)),\"\")","v":""},{"$f":"IFERROR(INDEX(別表!C122:'別表'!C125,MATCH(\"●\",別表!F122:'別表'!F125,0)),\"\")","v":""},{"$f":"D22","v":0},0,0,0,0,0,0,0,0,0,0,0,0,0,0,{"$f":"_xlfn.TEXTJOIN(\"　 \",TRUE,別表!I122:I125)","v":""},{"$f":"IFERROR(VLOOKUP(AQ24,別表!B122:G125,6,FALSE),\"\")","v":""},null,{"$f":"V23","v":""},{"$f":"W23","v":""},"","","",0,0,0,0,0,0,0,0,0,"00:00:00","00:00:00",0,0,0,0,null,""]
[{"$f":"A2","v":"00:00:00"},{"$f":"IFERROR(INDEX(別表!B126:'別表'!B130,MATCH(\"●\",別表!F126:'別表'!F130,0)),\"\")","v":""},{"$f":"IFERROR(INDEX(別表!C126:'別表'!C130,MATCH(\"●\",別表!F126:'別表'!F130,0)),\"\")","v":""},{"$f":"D23","v":0},0,0,0,0,0,0,0,0,0,0,0,0,0,0,{"$f":"_xlfn.TEXTJOIN(\"　 \",TRUE,別表!I126:I130)","v":""},{"$f":"IFERROR(VLOOKUP(AQ25,別表!B126:G130,6,FALSE),\"\")","v":""},null,{"$f":"V24","v":""},{"$f":"W24","v":""},"","","",0,0,0,0,0,0,0,0,0,"00:00:00","00:00:00",0,0,0,0,null,""]
[{"$f":"A2","v":"00:00:00"},{"$f":"IFERROR(INDEX(別表!B131:'別表'!B133,MATCH(\"●\",別表!F131:'別表'!F133,0)),\"\")","v":""},{"$f":"IFERROR(INDEX(別表!C131:'別表'!C133,MATCH(\"●\",別表!F131:'別表'!F133,0)),\"\")","v":""},{"$f":"D24","v":0},0,0,0,0,0,0,0,0,0,0,0,0,0,0,{"$f":"_xlfn.TEXTJOIN(\"　 \",TRUE,別表!I131:I133)","v":""},{"$f":"IFERROR(VLOOKUP(AQ26,別表!B131:G133,6,FALSE),\"\")","v":""},null,{"$f":"V25","v":""},{"$f":"W25","v":""},"","","",0,0,0,0,0,0,0,0,0,"00:00:00","00:00:00",0,0,0,0,null,""]
[{"$f":"A2","v":"00:00:00"},{"$f":"IFERROR(INDEX(別表!B134:'別表'!B144,MATCH(\"●\",別表!F134:'別表'!F144,0)),\"\")","v":""},{"$f":"IFERROR(INDEX(別表!C134:'別表'!C144,MATCH(\"●\",別表!F134:'別表'!F144,0)),\"\")","v":""},{"$f":"D25","v":0},0,0,0,0,0,0,0,0,0,0,0,0,0,0,{"$f":"_xlfn.TEXTJOIN(\"　 \",TRUE,別表!I134:I144)","v":""},{"$f":"IFERROR(VLOOKUP(AQ27,別表!B134:G144,6,FALSE),\"\")","v":""},null,"","",{"$f":"X26","v":""},{"$f":"Y26","v":""},{"$f":"Z26","v":""},{"$f":"AA26","v":0},{"$f":"AB26","v":0},{"$f":"AC26","v":0},{"$f":"AD26","v":0},{"$f":"AE26","v":0},{"$f":"AF26","v":0},{"$f":"AG26","v":0},{"$f":"AH26","v":0},{"$f":"AI26","v":0},{"$f":"AJ26","v":"00:00:00"},{"$f":"AK26","v":"00:00:00"},{"$f":"AL26","v":0},{"$f":"AM26","v":0},{"$f":"AN26","v":0},{"$f":"AO26","v":0},null,""]
[{"$f":"A2","v":"00:00:00"},{"$f":"IFERROR(INDEX(別表!B145:'別表'!B145,MATCH(\"●\",別表!F145:'別表'!F145,0)),\"\")","v":""},{"$f":"IFERROR(INDEX(別表!C145:'別表'!C145,MATCH(\"●\",別表!F145:'別表'!F145,0)),\"\")","v":""},{"$f":"D26","v":0},0,0,0,0,0,0,0,0,0,0,0,0,0,0,{"$f":"_xlfn.TEXTJOIN(\"　 \",TRUE,別表!I145:I145)","v":""},{"$f":"IFERROR(VLOOKUP(AQ28,別表!B145:G145,6,FALSE),\"\")","v":""},null,"","","","","",0,0,0,0,0,0,0,0,0,"00:00:00","00:00:00",0,0,0,0,null,""]
[{"$f":"A2","v":"00:00:00"},{"$f":"IFERROR(INDEX(別表!B146:'別表'!B146,MATCH(\"●\",別表!F146:'別表'!F146,0)),\"\")","v":""},{"$f":"IFERROR(INDEX(別表!C146:'別表'!C146,MATCH(\"●\",別表!F146:'別表'!F146,0)),\"\")","v":""},0,0,0,0,0,0,0,0,0,0,0,0,0,0,0,{"$f":"_xlfn.TEXTJOIN(\"　 \",TRUE,別表!I146:I146)","v":""},{"$f":"IFERROR(VLOOKUP(AQ29,別表!B146:G146,6,FALSE),\"\")","v":""},null,"","","","","",0,0,0,0,0,0,0,0,0,"00:00:00","00:00:00",0,0,0,0,null,""]